Reaction Details
TargetMAP kinase-interacting serine/threonine-protein kinase 2
LigandBDBM136175
Substrate/Competitorn/a
Meas. Tech.Inhibition Assay
pH7.4±n/a
Temperature303.15±n/a K
IC50 8±n/a nM
Commentsextracted
Citation Heckel, AHimmelsbach, FKley, JLehmann-Lintz, TRedemann, NSauer, AThomas, LWiedenmayer, DBlack, PBlackaby, WLinney, IAusten, MDanilewicz, JSchneider, MSchreiter, K Thienopyrimidines containing a substituted alkyl group for pharmaceutical compositions US Patent US8853193 Publication Date 10/7/2014
 
MAP kinase-interacting serine/threonine-protein kinase 2
Name:MAP kinase-interacting serine/threonine-protein kinase 2
Type:Protein
Mol. Mass.:51870.79
Organism:Homo sapiens (Human)
Description:Q9HBH9
Residue:465
BDBM136175
NameBDBM136175
Synonyms:US8853193, 16-2
TypeSmall organic molecule
Emp. Form.C17H19N5O3S
Mol. Mass.373.429
SMILESCC(CCN)Oc1ncccc1Nc1ncnc2sc(C(O)=O)c(C)c12