Reaction Details
TargetMAP kinase-interacting serine/threonine-protein kinase 2
LigandBDBM136188
Substrate/Competitorn/a
Meas. Tech.Inhibition Assay
pH7.4±n/a
Temperature303.15±n/a K
IC50 12±n/a nM
Commentsextracted
Citation Heckel, AHimmelsbach, FKley, JLehmann-Lintz, TRedemann, NSauer, AThomas, LWiedenmayer, DBlack, PBlackaby, WLinney, IAusten, MDanilewicz, JSchneider, MSchreiter, K Thienopyrimidines containing a substituted alkyl group for pharmaceutical compositions US Patent US8853193 Publication Date 10/7/2014
 
MAP kinase-interacting serine/threonine-protein kinase 2
Name:MAP kinase-interacting serine/threonine-protein kinase 2
Type:Protein
Mol. Mass.:51870.79
Organism:Homo sapiens (Human)
Description:Q9HBH9
Residue:465
BDBM136188
NameBDBM136188
Synonyms:US8853193, 21-6
TypeSmall organic molecule
Emp. Form.C17H16F3N5O2S
Mol. Mass.411.401
SMILESCNC(=O)c1sc2ncnc(Nc3cccnc3OC(C)C(F)(F)F)c2c1C