Reaction Details
TargetMAP kinase-interacting serine/threonine-protein kinase 2
LigandBDBM136247
Substrate/Competitorn/a
Meas. Tech.Inhibition Assay
pH7.4±n/a
Temperature303.15±n/a K
IC50 14±n/a nM
Commentsextracted
Citation Heckel, AHimmelsbach, FKley, JLehmann-Lintz, TRedemann, NSauer, AThomas, LWiedenmayer, DBlack, PBlackaby, WLinney, IAusten, MDanilewicz, JSchneider, MSchreiter, K Thienopyrimidines containing a substituted alkyl group for pharmaceutical compositions US Patent US8853193 Publication Date 10/7/2014
 
MAP kinase-interacting serine/threonine-protein kinase 2
Name:MAP kinase-interacting serine/threonine-protein kinase 2
Type:Protein
Mol. Mass.:51870.79
Organism:Homo sapiens (Human)
Description:Q9HBH9
Residue:465
BDBM136247
NameBDBM136247
Synonyms:US8853193, 36-19
TypeSmall organic molecule
Emp. Form.C20H22N6O2S
Mol. Mass.410.493
SMILESCC(C)Oc1ncccc1Nc1ncnc2sc(C(=O)NCC#CCN)c(C)c12