Reaction Details
TargetMAP kinase-interacting serine/threonine-protein kinase 2
LigandBDBM136259
Substrate/Competitorn/a
Meas. Tech.Inhibition Assay
pH7.4±n/a
Temperature303.15±n/a K
IC50 13±n/a nM
Commentsextracted
Citation Heckel, AHimmelsbach, FKley, JLehmann-Lintz, TRedemann, NSauer, AThomas, LWiedenmayer, DBlack, PBlackaby, WLinney, IAusten, MDanilewicz, JSchneider, MSchreiter, K Thienopyrimidines containing a substituted alkyl group for pharmaceutical compositions US Patent US8853193 Publication Date 10/7/2014
 
MAP kinase-interacting serine/threonine-protein kinase 2
Name:MAP kinase-interacting serine/threonine-protein kinase 2
Type:Protein
Mol. Mass.:51870.79
Organism:Homo sapiens (Human)
Description:Q9HBH9
Residue:465
BDBM136259
NameBDBM136259
Synonyms:US8853193, 50
TypeSmall organic molecule
Emp. Form.C24H26F2N6O2S
Mol. Mass.500.564
SMILESCN1CCC(CC1)NC(=O)c1sc2ncnc(Nc3ccc(cc3OC(CF)CF)C#N)c2c1C