Reaction Details
TargetFatty acid synthase
LigandBDBM137087
Substrate/Competitorn/a
Meas. Tech.Biochemical Assay
IC50 20±n/a nM
Citation Oslob, JDMcDowell, RSJohnson, RYang, HEvanchik, MZaharia, CACai, HHu, LW Heterocyclic modulators of lipid synthesis US Patent US8871790 Publication Date 10/28/2014
 
Fatty acid synthase
Name:Fatty acid synthase
Type:Enzyme
Mol. Mass.:273419.37
Organism:Homo sapiens (Human)
Description:P49327
Residue:2511
BDBM137087
NameBDBM137087
Synonyms:US8871790, 155
TypeSmall organic molecule
Emp. Form.C27H29N5O2
Mol. Mass.455.5515
SMILESCc1cc(C2CCC2)c(cc1C(=O)N1CCC(CC1)c1ccc(cc1)C#N)-c1nnc(CO)[nH]1