Reaction Details
TargetFatty acid synthase
LigandBDBM137179
Substrate/Competitorn/a
Meas. Tech.Biochemical Assay
IC50 20±n/a nM
Citation Oslob, JDMcDowell, RSJohnson, RYang, HEvanchik, MZaharia, CACai, HHu, LW Heterocyclic modulators of lipid synthesis US Patent US8871790 Publication Date 10/28/2014
 
Fatty acid synthase
Name:Fatty acid synthase
Type:Enzyme
Mol. Mass.:273419.37
Organism:Homo sapiens (Human)
Description:P49327
Residue:2511
BDBM137179
NameBDBM137179
Synonyms:US8871790, 247
TypeSmall organic molecule
Emp. Form.C29H31FN4O2
Mol. Mass.486.5804
SMILESCOCc1cnc([nH]1)-c1cc(C(=O)N2CCC(F)(CC2)c2ccc(cc2)C#N)c(C)cc1C1CCC1