Reaction Details
TargetFatty acid synthase
LigandBDBM137326
Substrate/Competitorn/a
Meas. Tech.Biochemical Assay
IC50 35±n/a nM
Citation Oslob, JDMcDowell, RSJohnson, RYang, HEvanchik, MZaharia, CACai, HHu, LW Heterocyclic modulators of lipid synthesis US Patent US8871790 Publication Date 10/28/2014
 
Fatty acid synthase
Name:Fatty acid synthase
Type:Enzyme
Mol. Mass.:273419.37
Organism:Homo sapiens (Human)
Description:P49327
Residue:2511
BDBM137326
NameBDBM137326
Synonyms:US8871790, 412
TypeSmall organic molecule
Emp. Form.C31H35N5O
Mol. Mass.493.6425
SMILESCCc1cc(C2CC2)c(cc1C(=O)N1CCC(CC1)c1ccc(cc1)C#N)-c1nc2CCN(C)Cc2[nH]1