Reaction Details
TargetFatty acid synthase
LigandBDBM137329
Substrate/Competitorn/a
Meas. Tech.Biochemical Assay
IC50 40±n/a nM
Citation Oslob, JDMcDowell, RSJohnson, RYang, HEvanchik, MZaharia, CACai, HHu, LW Heterocyclic modulators of lipid synthesis US Patent US8871790 Publication Date 10/28/2014
 
Fatty acid synthase
Name:Fatty acid synthase
Type:Enzyme
Mol. Mass.:273419.37
Organism:Homo sapiens (Human)
Description:P49327
Residue:2511
BDBM137329
NameBDBM137329
Synonyms:US8871790, 415
TypeSmall organic molecule
Emp. Form.C30H31FN4O2
Mol. Mass.498.5911
SMILESCC1COCc2[nH]c(nc12)-c1cc(ccc1C1CCC1)C(=O)N1CCC(F)(CC1)c1ccc(cc1)C#N