Reaction Details
TargetFatty acid synthase
LigandBDBM137331
Substrate/Competitorn/a
Meas. Tech.Biochemical Assay
IC50 20±n/a nM
Citation Oslob, JDMcDowell, RSJohnson, RYang, HEvanchik, MZaharia, CACai, HHu, LW Heterocyclic modulators of lipid synthesis US Patent US8871790 Publication Date 10/28/2014
 
Fatty acid synthase
Name:Fatty acid synthase
Type:Enzyme
Mol. Mass.:273419.37
Organism:Homo sapiens (Human)
Description:P49327
Residue:2511
BDBM137331
NameBDBM137331
Synonyms:US8871790, 417
TypeSmall organic molecule
Emp. Form.C30H33N5O
Mol. Mass.479.6159
SMILESCN1CCc2nc([nH]c2C1)-c1cc(ccc1C1CCC1)C(=O)N1CCC(CC1)c1ccc(cc1)C#N