Reaction Details
TargetFatty acid synthase
LigandBDBM137358
Substrate/Competitorn/a
Meas. Tech.Biochemical Assay
IC50 40±n/a nM
Citation Oslob, JDMcDowell, RSJohnson, RYang, HEvanchik, MZaharia, CACai, HHu, LW Heterocyclic modulators of lipid synthesis US Patent US8871790 Publication Date 10/28/2014
 
Fatty acid synthase
Name:Fatty acid synthase
Type:Enzyme
Mol. Mass.:273419.37
Organism:Homo sapiens (Human)
Description:P49327
Residue:2511
BDBM137358
NameBDBM137358
Synonyms:US8871790, 444
TypeSmall organic molecule
Emp. Form.C28H31FN4O3
Mol. Mass.490.5691
SMILESFC1(CCN(CC1)C(=O)c1ccc(C2CCC2)c(NC(=O)N[C@H]2CCOC2)c1)c1ccc(cc1)C#N