Reaction Details
TargetPoly [ADP-ribose] polymerase 1
LigandBDBM138321
Substrate/Competitorn/a
Meas. Tech.Biochemical Assay
Kd<30±n/a nM
Citation Papeo, GMAnatolievna Busel, AKhvat, AKrasavin, MYForte, BZuccotto, F 3-oxo-2,3-dihydro-1H-isoindole-4-carboxamides as PARP inhibitors US Patent US8877944 Publication Date 11/4/2014
 
Poly [ADP-ribose] polymerase 1
Name:Poly [ADP-ribose] polymerase 1
Type:PROTEIN
Mol. Mass.:113131.74
Organism:Mus musculus
Description:ChEMBL_159828
Residue:1013
BDBM138321
NameBDBM138321
Synonyms:US8877944, 25
TypeSmall organic molecule
Emp. Form.C22H25N3O2
Mol. Mass.363.4528
SMILESCc1cccc(CN2CCC(CC2)N2Cc3cccc(C(N)=O)c3C2=O)c1