Reaction Details
TargetPoly [ADP-ribose] polymerase 1
LigandBDBM138325
Substrate/Competitorn/a
Meas. Tech.Biochemical Assay
Kd<30±n/a nM
Citation Papeo, GMAnatolievna Busel, AKhvat, AKrasavin, MYForte, BZuccotto, F 3-oxo-2,3-dihydro-1H-isoindole-4-carboxamides as PARP inhibitors US Patent US8877944 Publication Date 11/4/2014
 
Poly [ADP-ribose] polymerase 1
Name:Poly [ADP-ribose] polymerase 1
Type:PROTEIN
Mol. Mass.:113131.74
Organism:Mus musculus
Description:ChEMBL_159828
Residue:1013
BDBM138325
NameBDBM138325
Synonyms:US8877944, 29
TypeSmall organic molecule
Emp. Form.C23H24N4O2
Mol. Mass.388.4623
SMILESNC(=O)c1cccc2CN(C3CCN(Cc4ccc5[nH]ccc5c4)CC3)C(=O)c12