Reaction Details
TargetPeptidyl-prolyl cis-trans isomerase A
LigandBDBM285725
Substrate/Competitorn/a
Meas. Tech.Protease-Free PPIase Assay
pH7.8±n/a
Ki 3.10±n/a nM
Commentsextracted
Citation Pettit, SNJones, ADFrydrych, CSThomas, AJGarst, ME Cyclosporins modified on the MeBmt sidechain by heterocyclic rings US Patent US10077289 Publication Date 9/18/2018
 
Peptidyl-prolyl cis-trans isomerase A
Name:Peptidyl-prolyl cis-trans isomerase A
Type:Protein
Mol. Mass.:18015.32
Organism:Homo sapiens (Human)
Description:P62937
Residue:165
BDBM285725
NameBDBM285725
Synonyms:US10077289, Compound 33 | [2S,3R,4R)-3-Hydroxy-4-methyl-2-(methylamino)-7-(pyrid-4-yl) heptanoic acid]1[(R)-methoxymethyl Sar]3 cyclosporin A
TypeSmall organic molecule
Emp. Form.C68H118N12O13
Mol. Mass.1311.7371
SMILESCC[C@H]1NC(=O)[C@@H]([C@H](O)[C@H](C)CCCc2ccncc2)N(C)C(=O)[C@@H](C(C)C)N(C)C(=O)[C@@H](CC(C)C)N(C)C(=O)[C@@H](CC(C)C)N(C)C(=O)[C@H](C)NC(=O)[C@@H](C)NC(=O)[C@@H](CC(C)C)N(C)C(=O)[C@H](NC(=O)[C@H](CC(C)C)N(C)C(=O)[C@@H](COC)N(C)C1=O)C(C)C