Reaction Details
TargetAcetyl-CoA carboxylase 2
LigandBDBM138599
Substrate/Competitorn/a
Meas. Tech.Spectrophotometric 384 Well Assay
pH7.5±n/a
IC50 29±n/a nM
Commentsextracted
Citation Fleck, MHeine, NNosse, BRoth, GJ Pyrrolidine derivatives, pharmaceutical compositions and uses thereof US Patent US8877741 Publication Date 11/4/2014
 
Acetyl-CoA carboxylase 2
Name:Acetyl-CoA carboxylase 2
Type:Protein
Mol. Mass.:276535.21
Organism:Homo sapiens (Human)
Description:O00763
Residue:2458
BDBM138599
NameBDBM138599
Synonyms:US8877741, 1.77
TypeSmall organic molecule
Emp. Form.C23H26ClF2N3O3
Mol. Mass.465.921
SMILESC[C@H](NC(C)=O)c1ccc(OC2CCN(C2)c2ncc(OCC3CC3(F)F)cc2Cl)cc1