Reaction Details
TargetAcetyl-CoA carboxylase 2
LigandBDBM138654
Substrate/Competitorn/a
Meas. Tech.Spectrophotometric 384 Well Assay
pH7.5±n/a
IC50 41±n/a nM
Commentsextracted
Citation Fleck, MHeine, NNosse, BRoth, GJ Pyrrolidine derivatives, pharmaceutical compositions and uses thereof US Patent US8877741 Publication Date 11/4/2014
 
Acetyl-CoA carboxylase 2
Name:Acetyl-CoA carboxylase 2
Type:Protein
Mol. Mass.:276535.21
Organism:Homo sapiens (Human)
Description:O00763
Residue:2458
BDBM138654
NameBDBM138654
Synonyms:US8877741, 1.132
TypeSmall organic molecule
Emp. Form.C23H27ClF2N4O2
Mol. Mass.464.936
SMILESC[C@H](NC(C)=O)c1ccc(O[C@@H]2CCN(C2)c2ccnc(N3CCC(F)(F)C3)c2Cl)cc1