Reaction Details
TargetAcetyl-CoA carboxylase 2
LigandBDBM138660
Substrate/Competitorn/a
Meas. Tech.Spectrophotometric 384 Well Assay
pH7.5±n/a
IC50 26±n/a nM
Commentsextracted
Citation Fleck, MHeine, NNosse, BRoth, GJ Pyrrolidine derivatives, pharmaceutical compositions and uses thereof US Patent US8877741 Publication Date 11/4/2014
 
Acetyl-CoA carboxylase 2
Name:Acetyl-CoA carboxylase 2
Type:Protein
Mol. Mass.:276535.21
Organism:Homo sapiens (Human)
Description:O00763
Residue:2458
BDBM138660
NameBDBM138660
Synonyms:US8877741, 1.138
TypeSmall organic molecule
Emp. Form.C23H29ClN4O2
Mol. Mass.428.955
SMILESC[C@H](NC(C)=O)c1ccc(O[C@@H]2CCN(C2)c2ccnc(NCC3CC3)c2Cl)cc1