Reaction Details
TargetAcetyl-CoA carboxylase 2
LigandBDBM138749
Substrate/Competitorn/a
Meas. Tech.Spectrophotometric 384 Well Assay
pH7.5±n/a
IC50 39±n/a nM
Commentsextracted
Citation Fleck, MHeine, NNosse, BRoth, GJ Pyrrolidine derivatives, pharmaceutical compositions and uses thereof US Patent US8877741 Publication Date 11/4/2014
 
Acetyl-CoA carboxylase 2
Name:Acetyl-CoA carboxylase 2
Type:Protein
Mol. Mass.:276535.21
Organism:Homo sapiens (Human)
Description:O00763
Residue:2458
BDBM138749
NameBDBM138749
Synonyms:US8877741, 2.75
TypeSmall organic molecule
Emp. Form.C29H35N5O5S
Mol. Mass.565.684
SMILESCOCC(=O)Nc1nc(C)c(s1)C(=O)N[C@@H](C)c1ccc(OC2CCN(C2)c2ccnc(OCC3CC3)c2)cc1