Reaction Details
TargetAcetyl-CoA carboxylase 2
LigandBDBM138825
Substrate/Competitorn/a
Meas. Tech.Spectrophotometric 384 Well Assay
pH7.5±n/a
IC50 39±n/a nM
Commentsextracted
Citation Fleck, MHeine, NNosse, BRoth, GJ Pyrrolidine derivatives, pharmaceutical compositions and uses thereof US Patent US8877741 Publication Date 11/4/2014
 
Acetyl-CoA carboxylase 2
Name:Acetyl-CoA carboxylase 2
Type:Protein
Mol. Mass.:276535.21
Organism:Homo sapiens (Human)
Description:O00763
Residue:2458
BDBM138825
NameBDBM138825
Synonyms:US8877741, 4.1 | US8877741, 675
TypeSmall organic molecule
Emp. Form.C23H27F2N3O4
Mol. Mass.447.475
SMILESCOC(=O)N[C@@H](C)c1ccc(OC2CCN(C2)c2ccc(OC[C@H]3CC3(F)F)cn2)cc1