Reaction Details
TargetAcetyl-CoA carboxylase 2
LigandBDBM138893
Substrate/Competitorn/a
Meas. Tech.Spectrophotometric 384 Well Assay
pH7.5±n/a
IC50 30±n/a nM
Commentsextracted
Citation Fleck, MHeine, NNosse, BRoth, GJ Pyrrolidine derivatives, pharmaceutical compositions and uses thereof US Patent US8877741 Publication Date 11/4/2014
 
Acetyl-CoA carboxylase 2
Name:Acetyl-CoA carboxylase 2
Type:Protein
Mol. Mass.:276535.21
Organism:Homo sapiens (Human)
Description:O00763
Residue:2458
BDBM138893
NameBDBM138893
Synonyms:US8877741, 9.29
TypeSmall organic molecule
Emp. Form.C24H33N3O3
Mol. Mass.411.5371
SMILESC[C@H](NC(C)=O)c1ccc(O[C@@H]2CCN(C2)c2ccnc(OCC(C)(C)C)c2)cc1