Reaction Details
TargetAcetyl-CoA carboxylase 2
LigandBDBM138928
Substrate/Competitorn/a
Meas. Tech.Spectrophotometric 384 Well Assay
pH7.5±n/a
IC50 35±n/a nM
Commentsextracted
Citation Fleck, MHeine, NNosse, BRoth, GJ Pyrrolidine derivatives, pharmaceutical compositions and uses thereof US Patent US8877741 Publication Date 11/4/2014
 
Acetyl-CoA carboxylase 2
Name:Acetyl-CoA carboxylase 2
Type:Protein
Mol. Mass.:276535.21
Organism:Homo sapiens (Human)
Description:O00763
Residue:2458
BDBM138928
NameBDBM138928
Synonyms:US8877741, 9.64
TypeSmall organic molecule
Emp. Form.C24H28N4O3S
Mol. Mass.452.569
SMILESCCCOc1cc(ccn1)N1CC[C@H](C1)Oc1ccc(cc1)[C@H](C)NC(=O)c1cncs1