Reaction Details
TargetAcetyl-CoA carboxylase 2
LigandBDBM139017
Substrate/Competitorn/a
Meas. Tech.Spectrophotometric 384 Well Assay
pH7.5±n/a
IC50 45±n/a nM
Commentsextracted
Citation Fleck, MHeine, NNosse, BRoth, GJ Pyrrolidine derivatives, pharmaceutical compositions and uses thereof US Patent US8877741 Publication Date 11/4/2014
 
Acetyl-CoA carboxylase 2
Name:Acetyl-CoA carboxylase 2
Type:Protein
Mol. Mass.:276535.21
Organism:Homo sapiens (Human)
Description:O00763
Residue:2458
BDBM139017
NameBDBM139017
Synonyms:US8877741, 14.2
TypeSmall organic molecule
Emp. Form.C24H29F2N3O4
Mol. Mass.461.5016
SMILESCOc1c(OCC2CC2(F)F)nccc1N1CC[C@H](C1)Oc1ccc(cc1)[C@H](C)NC(C)=O