Reaction Details
TargetDeoxyuridine 5'-triphosphate nucleotidohydrolase, mitochondrial
LigandBDBM101897
Substrate/Competitorn/a
Meas. Tech.Inhibition Assay
pH7.4±n/a
Temperature310.15±n/a K
IC50 130±n/a nM
Commentsextracted
Citation Fukuoka, MYokogawa, TMiyahara, SMiyakoshi, HYano, WTaguchi, JTakao, Y Anti-tumor effect potentiator US Patent US8883759 Publication Date 11/11/2014
 
Deoxyuridine 5'-triphosphate nucleotidohydrolase, mitochondrial
Name:Deoxyuridine 5'-triphosphate nucleotidohydrolase, mitochondrial
Type:Enzyme
Mol. Mass.:26574.03
Organism:Homo sapiens (Human)
Description:P33316
Residue:252
BDBM101897
NameBDBM101897
Synonyms:US8530490, 167
TypeSmall organic molecule
Emp. Form.C21H27N3O6S
Mol. Mass.449.521
SMILESO=c1ccn(COCCCC2(CC2)NS(=O)(=O)c2cccc(OCC3CC3)c2)c(=O)[nH]1