Reaction Details
TargetHistone deacetylase 6
LigandBDBM139312
Substrate/Competitorn/a
Meas. Tech.Enzyme Assay
pH7.4±n/a
Temperature298.15±n/a K
IC50 1±n/a nM
Commentsextracted
Citation van Duzer, JHMazitschek, RDing, YYu, NCao, YLiu, Y Pyrimidine hydroxy amide compounds as protein deacetylase inhibitors and methods of use thereof US Patent US8614223 Publication Date 12/24/2013
 
Histone deacetylase 6
Name:Histone deacetylase 6
Type:Chromatin regulator; hydrolase; repressor
Mol. Mass.:131381.51
Organism:Homo sapiens (Human)
Description:Q9UBN7
Residue:1215
BDBM139312
NameBDBM139312
Synonyms:US8614223, 90
TypeSmall organic molecule
Emp. Form.C14H13ClN4O2
Mol. Mass.304.732
SMILESONC(=O)c1cnc(NC2(CC2)c2ccccc2Cl)nc1