Reaction Details
Target5-hydroxytryptamine receptor 2A
LigandBDBM139371
Substrate/Competitorn/a
Meas. Tech.Radioligand Binding Assay
Temperature277.15±n/a K
Ki 0.046±0.018 nM
Commentsextracted
Citation Vanover, KEWeiner, DMMakhay, MVeinbergs, IGardell, LRLameh, JDel Tredici, ALPiu, FSchiffer, HHOtt, TRBurstein, ESUldam, AKThygesen, MBSchlienger, NAndersson, CMSon, TYHarvey, SCPowell, SBGeyer, MATolf, BRBrann, MRDavis, RE Pharmacological and behavioral profile of N-(4-fluorophenylmethyl)-N-(1-methylpiperidin-4-yl)-N'-(4-(2-methylpropyloxy)phenylmethyl) carbamide (2R,3R)-dihydroxybutanedioate (2:1) (ACP-103), a novel 5-hydroxytryptamine(2A) receptor inverse agonist. J Pharmacol Exp Ther317:910-8 (2006) 
 
5-hydroxytryptamine receptor 2A
Name:5-hydroxytryptamine receptor 2A
Type:undefined
Mol. Mass.:52607.65
Organism:Homo sapiens (Human)
Description:P28223
Residue:471
BDBM139371
NameBDBM139371
Synonyms:eplivanserin
TypeSmall organic molecule
Emp. Form.C19H21FN2O2
Mol. Mass.328.3806
SMILES[#6]-[#7](-[#6])-[#6]-[#6]-[#8]-[#7]\[#6](=[#6]\[#6]=[#6]-1\[#6]=[#6]-[#6](=O)-[#6]=[#6]-1)-c1ccccc1F