Reaction Details
TargetPeptidyl-prolyl cis-trans isomerase G
LigandBDBM139995
Substrate/Competitorn/a
Meas. Tech.Enzymatic Assay
pH7.8±n/a
Temperature293.15±n/a K
IC50 16800±n/a nM
Commentsextracted
Citation Guichou, JColliandre, LAhmed-Belkacem, HPawlotsky, J Inhibitors of cyclophilins and uses thereof US Patent US8901295 Publication Date 12/2/2014
 
Peptidyl-prolyl cis-trans isomerase G
Name:Peptidyl-prolyl cis-trans isomerase G
Type:Enzyme
Mol. Mass.:88718.95
Organism:Homo sapiens (Human)
Description:Q13427
Residue:754
BDBM139995
NameBDBM139995
Synonyms:US8901295, F428
TypeSmall organic molecule
Emp. Form.C12H17N3O3
Mol. Mass.251.2817
SMILESCCOC(=O)CNC(=O)NCc1ccc(N)cc1