Reaction Details
TargetPeptidyl-prolyl cis-trans isomerase G
LigandBDBM140007
Substrate/Competitorn/a
Meas. Tech.Enzymatic Assay
pH7.8±n/a
Temperature293.15±n/a K
IC50 3100±n/a nM
Commentsextracted
Citation Guichou, JColliandre, LAhmed-Belkacem, HPawlotsky, J Inhibitors of cyclophilins and uses thereof US Patent US8901295 Publication Date 12/2/2014
 
Peptidyl-prolyl cis-trans isomerase G
Name:Peptidyl-prolyl cis-trans isomerase G
Type:Enzyme
Mol. Mass.:88718.95
Organism:Homo sapiens (Human)
Description:Q13427
Residue:754
BDBM140007
NameBDBM140007
Synonyms:US8901295, F714
TypeSmall organic molecule
Emp. Form.C22H28N4O2S
Mol. Mass.412.548
SMILESCSc1ccccc1C1CCCN1C(=O)C(C)NC(=O)NCc1ccc(N)cc1