Reaction Details
TargetHigh affinity cAMP-specific 3',5'-cyclic phosphodiesterase 7A
LigandBDBM140083
Substrate/Competitorn/a
Meas. Tech.Inhibition Assay
pH7.5±n/a
Temperature277.15±n/a K
IC50 35±n/a nM
Commentsextracted
Citation Inoue, HMurafuji, HHayashi, Y Thienopyrazole derivative having PDE7 inhibitory activity US Patent US8901315 Publication Date 12/2/2014
 
High affinity cAMP-specific 3',5'-cyclic phosphodiesterase 7A
Name:High affinity cAMP-specific 3',5'-cyclic phosphodiesterase 7A
Type:Enzyme
Mol. Mass.:55514.96
Organism:Homo sapiens (Human)
Description:Q13946
Residue:482
BDBM140083
NameBDBM140083
Synonyms:US8901315, 159 US8901315, 366
TypeSmall organic molecule
Emp. Form.C24H29FN4O2S
Mol. Mass.456.576
SMILESCc1nn(C2CCCCC2)c2sc(cc12)C(=O)Nc1ccc(N2CCC(O)CC2)c(F)c1