Reaction Details
TargetHigh affinity cAMP-specific 3',5'-cyclic phosphodiesterase 7A
LigandBDBM140099
Substrate/Competitorn/a
Meas. Tech.Inhibition Assay
pH7.5±n/a
Temperature277.15±n/a K
IC50 6.5±n/a nM
Commentsextracted
Citation Inoue, HMurafuji, HHayashi, Y Thienopyrazole derivative having PDE7 inhibitory activity US Patent US8901315 Publication Date 12/2/2014
 
High affinity cAMP-specific 3',5'-cyclic phosphodiesterase 7A
Name:High affinity cAMP-specific 3',5'-cyclic phosphodiesterase 7A
Type:Enzyme
Mol. Mass.:55514.96
Organism:Homo sapiens (Human)
Description:Q13946
Residue:482
BDBM140099
NameBDBM140099
Synonyms:US8901315, 188
TypeSmall organic molecule
Emp. Form.C23H35N5OS
Mol. Mass.429.622
SMILESCc1nn(C2CCCCC2)c2sc(cc12)C(=O)N[C@H]1CC[C@@H](CC1)N1CCNCC1