Reaction Details
TargetPhosphodiesterase
LigandBDBM140083
Substrate/Competitorn/a
Meas. Tech.Inhibition Assay
pH6.5±n/a
Temperature277.15±n/a K
IC50 1600±n/a nM
Commentsextracted
Citation Inoue, HMurafuji, HHayashi, Y Thienopyrazole derivative having PDE7 inhibitory activity US Patent US8901315 Publication Date 12/2/2014
 
Phosphodiesterase
Name:Phosphodiesterase
Synonyms:Phosphodiesterase 4 (PDE4)
Type:Protein
Mol. Mass.:82059.36
Organism:Mus musculus (Mouse)
Description:Q8VBU5
Residue:721
BDBM140083
NameBDBM140083
TypeSmall organic molecule
Emp. Form.C24H29FN4O2S
Mol. Mass.456.576
SMILESCc1nn(C2CCCCC2)c2sc(cc12)C(=O)Nc1ccc(N2CCC(O)CC2)c(F)c1