Reaction Details
TargetPhosphodiesterase
LigandBDBM140108
Substrate/Competitorn/a
Meas. Tech.Inhibition Assay
pH6.5±n/a
Temperature277.15±n/a K
IC50 1400±n/a nM
Commentsextracted
Citation Inoue, HMurafuji, HHayashi, Y Thienopyrazole derivative having PDE7 inhibitory activity US Patent US8901315 Publication Date 12/2/2014
 
Phosphodiesterase
Name:Phosphodiesterase
Synonyms:Phosphodiesterase 4 (PDE4)
Type:Protein
Mol. Mass.:82059.36
Organism:Mus musculus (Mouse)
Description:Q8VBU5
Residue:721
BDBM140108
NameBDBM140108
Synonyms:US8901315, 203
TypeSmall organic molecule
Emp. Form.C23H25N5O3S
Mol. Mass.451.541
SMILESCN1CC(=O)N(C1=O)c1ccc(NC(=O)c2cc3c(C)nn(C4CCCCC4)c3s2)cc1