Reaction Details
TargetPhosphodiesterase
LigandBDBM140171
Substrate/Competitorn/a
Meas. Tech.Inhibition Assay
pH6.5±n/a
Temperature277.15±n/a K
IC50 1200±n/a nM
Commentsextracted
Citation Inoue, HMurafuji, HHayashi, Y Thienopyrazole derivative having PDE7 inhibitory activity US Patent US8901315 Publication Date 12/2/2014
 
Phosphodiesterase
Name:Phosphodiesterase
Synonyms:Phosphodiesterase 4 (PDE4)
Type:Protein
Mol. Mass.:82059.36
Organism:Mus musculus (Mouse)
Description:Q8VBU5
Residue:721
BDBM140171
NameBDBM140171
Synonyms:US8901315, 379
TypeSmall organic molecule
Emp. Form.C21H25N5O3S
Mol. Mass.427.52
SMILESCc1nn(C2CCCCC2)c2sc(cc12)C(=O)Nc1ccc(nc1)C(=O)NCCO