Reaction Details
TargetLysosomal acid glucosylceramidase
LigandBDBM285821
Substrate/Competitorn/a
Meas. Tech.Assay for Determination of Ki Values for Inhibition of GCase Activity
pH7±n/a
Ki 2.10±n/a nM
Commentsextracted
Citation Kaul, RMcEachern, EJSun, JVocadlo, DJZhou, YZhu, Y Glucocerebrosidase modulators and uses thereof US Patent US10081601 Publication Date 9/25/2018
 
Lysosomal acid glucosylceramidase
Name:Lysosomal acid glucosylceramidase
Type:Enzyme
Mol. Mass.:59724.64
Organism:Homo sapiens (Human)
Description:The beta-Glu activity was measured with commercially available beta-glucocerebrosidase (Ceredase) as the enzyme source.
Residue:536
BDBM285821
NameBDBM285821
Synonyms:(6R,7R,8S)-8-(fluoromethyl)-4-azaspiro[2.5]octane-6,7-diol US9796680, Example 3
TypeSmall organic molecule
Emp. Form.C8H14FNO2
Mol. Mass.175.2007
SMILESO[C@@H]1CNC2(CC2)[C@H](CF)[C@H]1O