Reaction Details
TargetRho-associated protein kinase 2
LigandBDBM141006
Substrate/Competitorn/a
Meas. Tech.Binding Assay
IC50 130±n/a nM
Citation Bartolozzi, ACampbell, SFoudoulakis, HKirk, BRam, SSweetnam, PSeshadri, H Pharmacokinetically improved compounds US Patent US8916576 Publication Date 12/23/2014
 
Rho-associated protein kinase 2
Name:Rho-associated protein kinase 2
Type:Protein
Mol. Mass.:160885.43
Organism:Homo sapiens (Human)
Description:O75116
Residue:1388
BDBM141006
NameBDBM141006
Synonyms:US8916576, 211
TypeSmall organic molecule
Emp. Form.C25H21N5O2
Mol. Mass.423.4665
SMILESCCCC(=O)Oc1cccc(c1)-c1nc(Nc2ccc3[nH]ncc3c2)c2ccccc2n1