Reaction Details
TargetRho-associated protein kinase 2
LigandBDBM140998
Substrate/Competitorn/a
Meas. Tech.Binding Assay
IC50 68±n/a nM
Citation Bartolozzi, ACampbell, SFoudoulakis, HKirk, BRam, SSweetnam, PSeshadri, H Pharmacokinetically improved compounds US Patent US8916576 Publication Date 12/23/2014
 
Rho-associated protein kinase 2
Name:Rho-associated protein kinase 2
Type:Protein
Mol. Mass.:160885.43
Organism:Homo sapiens (Human)
Description:O75116
Residue:1388
BDBM140998
NameBDBM140998
Synonyms:US10570123, Example 201 | US8916576, 201
TypeSmall organic molecule
Emp. Form.C28H28N6O3
Mol. Mass.496.5603
SMILESCCCC(=O)Nc1cccc(c1)-c1nc(Nc2ccc3[nH]ncc3c2)c2cc(OCCOC)ccc2n1