Reaction Details
TargetRho-associated protein kinase 2
LigandBDBM141001
Substrate/Competitorn/a
Meas. Tech.Binding Assay
IC50 13±n/a nM
Citation Bartolozzi, ACampbell, SFoudoulakis, HKirk, BRam, SSweetnam, PSeshadri, H Pharmacokinetically improved compounds US Patent US8916576 Publication Date 12/23/2014
 
Rho-associated protein kinase 2
Name:Rho-associated protein kinase 2
Type:Protein
Mol. Mass.:160885.43
Organism:Homo sapiens (Human)
Description:O75116
Residue:1388
BDBM141001
NameBDBM141001
Synonyms:US10570123, Example 205 | US8916576, 205
TypeSmall organic molecule
Emp. Form.C31H33N7O3
Mol. Mass.551.6388
SMILESCCCC(=O)Nc1cccc(c1)-c1nc(Nc2ccc3[nH]ncc3c2)c2cc(OCCN3CCC(O)C3)ccc2n1