Reaction Details
TargetRho-associated protein kinase 2
LigandBDBM141032
Substrate/Competitorn/a
Meas. Tech.Binding Assay
IC50>300±n/a nM
Citation Bartolozzi, ACampbell, SFoudoulakis, HKirk, BRam, SSweetnam, PSeshadri, H Pharmacokinetically improved compounds US Patent US8916576 Publication Date 12/23/2014
 
Rho-associated protein kinase 2
Name:Rho-associated protein kinase 2
Type:Protein
Mol. Mass.:160885.43
Organism:Homo sapiens (Human)
Description:O75116
Residue:1388
BDBM141032
NameBDBM141032
Synonyms:US10570123, Example 243 | US8916576, 243
TypeSmall organic molecule
Emp. Form.C30H33N7O2
Mol. Mass.523.6287
SMILESCCCC(=O)Nc1cccc(c1)-c1nc(Nc2ccc3n(C)ncc3c2)c2cc(OCCN(C)C)ccc2n1