Reaction Details
TargetPlasminogen
LigandBDBM50380626
Substrate/Competitorn/a
Meas. Tech.Enzyme Assay
pH8±n/a
Ki 2.2±n/a nM
Commentsextracted
Citation Steinmetzer, TSaupe, SM Serine protease inhibitors US Patent US8921319 Publication Date 12/30/2014
 
Plasminogen
Name:Plasminogen
Type:Enzyme
Mol. Mass.:90579.18
Organism:Homo sapiens (Human)
Description:n/a
Residue:810
BDBM50380626
NameBDBM50380626
Synonyms:CHEMBL2016874
TypeSmall organic molecule
Emp. Form.C32H34N12O4S
Mol. Mass.682.755
SMILESNC(=N)c1ccc(CNC(=O)[C@@H]2Cc3cn(Cc4cccc(Cn5cc(C[C@@H](NS(=O)(=O)Cc6ccccc6)C(=O)N2)nn5)n4)nn3)cc1