Reaction Details
TargetPlasma kallikrein
LigandBDBM141387
Substrate/Competitorn/a
Meas. Tech.Enzyme Assay
pH8±n/a
Ki 550±n/a nM
Commentsextracted
Citation Steinmetzer, TSaupe, SM Serine protease inhibitors US Patent US8921319 Publication Date 12/30/2014
 
Plasma kallikrein
Name:Plasma kallikrein
Type:Protein
Mol. Mass.:71391.16
Organism:Homo sapiens (Human)
Description:P03952
Residue:638
BDBM141387
NameBDBM141387
Synonyms:US8921319, 3
TypeSmall organic molecule
Emp. Form.C45H47N7O6S
Mol. Mass.813.963
SMILESNC(=N)c1ccc(CNC(=O)[C@@H]2Cc3ccc(CNC(=O)Cc4cccc(CC(=O)NCc5ccc(C[C@@H](NS(=O)(=O)Cc6ccccc6)C(=O)N2)cc5)c4)cc3)cc1