Reaction Details
TargetProthrombin
LigandBDBM50380618
Substrate/Competitorn/a
Meas. Tech.Enzyme Assay
pH8±n/a
Ki 45.4±n/a nM
Commentsextracted
Citation Steinmetzer, TSaupe, SM Serine protease inhibitors US Patent US8921319 Publication Date 12/30/2014
 
Prothrombin
Name:Prothrombin
Type:Protein
Mol. Mass.:70029.57
Organism:Homo sapiens (Human)
Description:P00734
Residue:622
BDBM50380618
NameBDBM50380618
Synonyms:CHEMBL2016868
TypeSmall organic molecule
Emp. Form.C45H47N7O6S
Mol. Mass.813.963
SMILESNC(=N)c1ccc(CNC(=O)[C@@H]2Cc3cccc(CNC(=O)Cc4ccc(CC(=O)NCc5cccc(C[C@@H](NS(=O)(=O)Cc6ccccc6)C(=O)N2)c5)cc4)c3)cc1