Reaction Details
TargetCoagulation factor X
LigandBDBM141391
Substrate/Competitorn/a
Meas. Tech.Enzyme Assay
pH8±n/a
Ki>10000±n/a nM
Commentsextracted
Citation Steinmetzer, TSaupe, SM Serine protease inhibitors US Patent US8921319 Publication Date 12/30/2014
 
Coagulation factor X
Name:Coagulation factor X
Type:Enzyme
Mol. Mass.:54726.60
Organism:Homo sapiens (Human)
Description:n/a
Residue:488
BDBM141391
NameBDBM141391
Synonyms:US8921319, 15
TypeSmall organic molecule
Emp. Form.C33H38N6O7S
Mol. Mass.662.756
SMILESOC(=O)[C@@H]1Cc2ccc(NC(=O)CN3CCN(CC3)CC(=O)Nc3ccc(C[C@@H](NS(=O)(=O)Cc4ccccc4)C(=O)N1)cc3)cc2