Reaction Details
TargetEF-hand calcium-binding domain-containing protein 4B
LigandBDBM141404
Substrate/Competitorn/a
Meas. Tech.In-Vitro Inhibition Assay
Temperature310.15±n/a K
IC50 184.6±n/a nM
Commentsextracted
Citation Muthuppalaniappan, MViswanadha, SMerikapudi, GSVakkalanka, SK Modulators of calcium release-activated calcium channel US Patent US8921364 Publication Date 12/30/2014
 
EF-hand calcium-binding domain-containing protein 4B
Name:EF-hand calcium-binding domain-containing protein 4B
Type:Protein
Mol. Mass.:45570.29
Organism:Homo sapiens (Human)
Description:Q9BSW2
Residue:731
BDBM141404
NameBDBM141404
Synonyms:US10668051, Compound Example 35 | US8921364, 35
TypeSmall organic molecule
Emp. Form.C21H19FN4O
Mol. Mass.362.4002
SMILESFc1cc(NC(=O)c2ccncc2)ccc1-n1nc(cc1C1CC1)C1CC1