Reaction Details
TargetEF-hand calcium-binding domain-containing protein 4B
LigandBDBM141406
Substrate/Competitorn/a
Meas. Tech.In-Vitro Inhibition Assay
Temperature310.15±n/a K
IC50 181.1±n/a nM
Commentsextracted
Citation Muthuppalaniappan, MViswanadha, SMerikapudi, GSVakkalanka, SK Modulators of calcium release-activated calcium channel US Patent US8921364 Publication Date 12/30/2014
 
EF-hand calcium-binding domain-containing protein 4B
Name:EF-hand calcium-binding domain-containing protein 4B
Type:Protein
Mol. Mass.:45570.29
Organism:Homo sapiens (Human)
Description:Q9BSW2
Residue:731
BDBM141406
NameBDBM141406
Synonyms:US10668051, Compound Example 37 | US8921364, 37
TypeSmall organic molecule
Emp. Form.C19H17ClFN5OS
Mol. Mass.417.888
SMILESCc1nnsc1C(=O)Nc1ccc(c(F)c1)-n1nc(C2CC2)c(Cl)c1C1CC1