Reaction Details
TargetEF-hand calcium-binding domain-containing protein 4B
LigandBDBM141413
Substrate/Competitorn/a
Meas. Tech.In-Vitro Inhibition Assay
Temperature310.15±n/a K
IC50 124.5±n/a nM
Commentsextracted
Citation Muthuppalaniappan, MViswanadha, SMerikapudi, GSVakkalanka, SK Modulators of calcium release-activated calcium channel US Patent US8921364 Publication Date 12/30/2014
 
EF-hand calcium-binding domain-containing protein 4B
Name:EF-hand calcium-binding domain-containing protein 4B
Type:Protein
Mol. Mass.:45570.29
Organism:Homo sapiens (Human)
Description:Q9BSW2
Residue:731
BDBM141413
NameBDBM141413
Synonyms:US10668051, Compound Example 57 | US8921364, 57
TypeSmall organic molecule
Emp. Form.C19H17F3N4O2
Mol. Mass.390.3591
SMILESCc1noc(C)c1C(=O)Nc1ccc(cc1)-n1nc(cc1C1CC1)C(F)(F)F