Reaction Details
TargetEF-hand calcium-binding domain-containing protein 4B
LigandBDBM141429
Substrate/Competitorn/a
Meas. Tech.In-Vitro Inhibition Assay
Temperature310.15±n/a K
IC50 98.58±n/a nM
Commentsextracted
Citation Muthuppalaniappan, MViswanadha, SMerikapudi, GSVakkalanka, SK Modulators of calcium release-activated calcium channel US Patent US8921364 Publication Date 12/30/2014
 
EF-hand calcium-binding domain-containing protein 4B
Name:EF-hand calcium-binding domain-containing protein 4B
Type:Protein
Mol. Mass.:45570.29
Organism:Homo sapiens (Human)
Description:Q9BSW2
Residue:731
BDBM141429
NameBDBM141429
Synonyms:US10668051, Compound Example 88 | US8921364, 88
TypeSmall organic molecule
Emp. Form.C20H13F6N3O
Mol. Mass.425.3271
SMILESFc1cccc(F)c1C(=O)Nc1ccc(c(F)c1)-n1nc(cc1C1CC1)C(F)(F)F