Reaction Details
TargetEF-hand calcium-binding domain-containing protein 4B
LigandBDBM141439
Substrate/Competitorn/a
Meas. Tech.In-Vitro Inhibition Assay
Temperature310.15±n/a K
IC50 60±n/a nM
Commentsextracted
Citation Muthuppalaniappan, MViswanadha, SMerikapudi, GSVakkalanka, SK Modulators of calcium release-activated calcium channel US Patent US8921364 Publication Date 12/30/2014
 
EF-hand calcium-binding domain-containing protein 4B
Name:EF-hand calcium-binding domain-containing protein 4B
Type:Protein
Mol. Mass.:45570.29
Organism:Homo sapiens (Human)
Description:Q9BSW2
Residue:731
BDBM141439
NameBDBM141439
Synonyms:US10668051, Compound Example 106 | US8921364, 106
TypeSmall organic molecule
Emp. Form.C19H14F4N4O
Mol. Mass.390.3343
SMILESFc1ccccc1C(=O)Nc1ccc(nc1)-n1nc(cc1C1CC1)C(F)(F)F