Reaction Details
TargetEF-hand calcium-binding domain-containing protein 4B
LigandBDBM141447
Substrate/Competitorn/a
Meas. Tech.In-Vitro Inhibition Assay
Temperature310.15±n/a K
IC50 373.4±n/a nM
Commentsextracted
Citation Muthuppalaniappan, MViswanadha, SMerikapudi, GSVakkalanka, SK Modulators of calcium release-activated calcium channel US Patent US8921364 Publication Date 12/30/2014
 
EF-hand calcium-binding domain-containing protein 4B
Name:EF-hand calcium-binding domain-containing protein 4B
Type:Protein
Mol. Mass.:45570.29
Organism:Homo sapiens (Human)
Description:Q9BSW2
Residue:731
BDBM141447
NameBDBM141447
Synonyms:US10668051, Compound Example 125 | US8921364, 125
TypeSmall organic molecule
Emp. Form.C16H12F4N4OS
Mol. Mass.384.351
SMILESCc1ncsc1C(=O)Nc1ccc(cc1)-n1nc(cc1CF)C(F)(F)F