Reaction Details
TargetMetabotropic glutamate receptor 5
LigandBDBM141509
Substrate/Competitorn/a
Meas. Tech.Radioligand Binding Assay
pH7.4±n/a
Temperature298.15±n/a K
Ki 500±n/a nM
Commentsextracted
Citation Li, GZhou, HWeiss, JDoller, DBurns, JF Bicyclo[3.2.1]octyl amide derivatives and uses of same US Patent US8921370 Publication Date 12/30/2014
 
Metabotropic glutamate receptor 5
Name:Metabotropic glutamate receptor 5
Type:Enzyme
Mol. Mass.:132484.72
Organism:Homo sapiens (Human)
Description:n/a
Residue:1212
BDBM141509
NameBDBM141509
Synonyms:US8921370, 176 | US9656975, 176
TypeSmall organic molecule
Emp. Form.C22H24ClN3O2
Mol. Mass.397.898
SMILESCc1cccc(NC(=O)C23CCC(C2)(CCC3)NC(=O)c2cccc(Cl)c2)n1