Reaction Details
TargetMetabotropic glutamate receptor 5
LigandBDBM141501
Substrate/Competitorn/a
Meas. Tech.Calcium Mobilization Assay
pH7.4±n/a
Temperature310.15±n/a K
IC50 3.7±n/a nM
Commentsextracted
Citation Li, GZhou, HWeiss, JDoller, DBurns, JF Bicyclo[3.2.1]octyl amide derivatives and uses of same US Patent US8921370 Publication Date 12/30/2014
 
Metabotropic glutamate receptor 5
Name:Metabotropic glutamate receptor 5
Type:Enzyme
Mol. Mass.:132484.72
Organism:Homo sapiens (Human)
Description:n/a
Residue:1212
BDBM141501
NameBDBM141501
Synonyms:US8921370, 2 | US9656975, 2
TypeSmall organic molecule
Emp. Form.C22H24ClN3O2
Mol. Mass.397.898
SMILESCc1cccc(n1)C(=O)NC12CCC(C1)(CCC2)NC(=O)c1cccc(Cl)c1