Reaction Details
TargetTyrosine-protein kinase JAK3
LigandBDBM100348
Substrate/Competitorn/a
Meas. Tech.Ambit KinomeScan Assay
Kd 2.9±n/a nM
Citation Bauer, SMPandey, A Inhibitors of protein kinases US Patent US8937070 Publication Date 1/20/2015
 
Tyrosine-protein kinase JAK3
Name:Tyrosine-protein kinase JAK3
Type:Protein
Mol. Mass.:125111.08
Organism:Homo sapiens (Human)
Description:P52333
Residue:1124
BDBM100348
NameBDBM100348
Synonyms:US10533001, Example Table 9a.1 US8501944, 370 US9868729, Example 38
TypeSmall organic molecule
Emp. Form.C21H27N7O3
Mol. Mass.425.4842
SMILESCOCC(=O)N1CCN(CC1)c1ccc(Nc2ncc(C(N)=O)c(NC3CC3)n2)cc1