Reaction Details
TargetTyrosine-protein kinase JAK3
LigandBDBM100351
Substrate/Competitorn/a
Meas. Tech.Ambit KinomeScan Assay
Kd 4.1±n/a nM
Citation Bauer, SMPandey, A Inhibitors of protein kinases US Patent US8937070 Publication Date 1/20/2015
 
Tyrosine-protein kinase JAK3
Name:Tyrosine-protein kinase JAK3
Type:Protein
Mol. Mass.:125111.08
Organism:Homo sapiens (Human)
Description:P52333
Residue:1124
BDBM100351
NameBDBM100351
Synonyms:US10533001, Example Table 9a.4 US8501944, 373 US9868729, Example 254
TypeSmall organic molecule
Emp. Form.C20H25N7O2
Mol. Mass.395.4582
SMILESNC(=O)[C@@H]1CCCN(C1)c1ccc(Nc2ncc(C(N)=O)c(NC3CC3)n2)cc1